{"text_format":"1","workbook":"xlsx","n_sheets":7,"sheets":["Names","Score","R1","R2","R3","Sheet1","MP_PP"],"not_rendered":{"charts":0,"images":1,"macros":1,"external_links":1,"defined_names":4,"comments":0,"pivot_tables":0},"unopened":[],"bounds":{"document_bytes":16777216,"sheet_cells":100000,"rows_first":2000,"rows_last":500,"rows_between":2000,"halvings":0,"cell_chars":16384,"cell_head_chars":4096},"cells_cut":0,"cells_raw":0,"read":"whole","date_system":"1900"}

{"sheet":"Names","index":0,"n_rows":163,"n_cols":12,"rows_kept":163,"cut":false,"hidden":false,"merged":[[45,3,48,3],[1,3,4,3],[5,3,8,3],[9,3,12,3],[13,3,16,3],[17,3,20,3],[21,3,24,3],[25,3,28,3],[29,3,32,3],[33,3,36,3],[37,3,40,3],[41,3,44,3],[73,3,76,3],[77,3,80,3],[49,3,52,3],[53,3,56,3],[57,3,60,3],[61,3,64,3],[65,3,68,3],[69,3,72,3],[81,3,84,3],[85,3,88,3],[89,3,92,3],[93,3,96,3],[97,3,100,3],[101,3,104,3],[105,3,108,3],[109,3,112,3],[113,3,116,3],[117,3,120,3],[121,3,124,3],[125,3,128,3],[129,3,132,3],[133,3,136,3],[137,3,140,3],[141,3,144,3],[145,3,148,3],[149,3,152,3],[153,3,156,3],[157,3,160,3]]}
[0,"Names",null,"Tab."]
[1,"إبراهيم عرفان السقا",721,1,null,{"$f":"LOOKUP(H2,$I$2:$I$161,$K$2:$K$161)","v":"هيثم أحمد دياب"},{"$f":"LOOKUP(H2,$I$2:$I$161,$L$2:$L$161)","v":725},1,1,{"$f":"LOOKUP(L2,[1]Rank!$B$9:$B$782,[1]Rank!$E$9:$E$782)","v":0},{"$f":"LOOKUP(L2,[1]Rank!$B$9:$B$782,[1]Rank!$F$9:$F$782)","v":"هيثم أحمد دياب"},725]
[2,"مصطفى محمد علي شرف",449,null,null,"مصطفى محمد علي شرف",449,11,2,{"$f":"LOOKUP(L3,[1]Rank!$B$9:$B$782,[1]Rank!$E$9:$E$782)","v":"*"},{"$f":"LOOKUP(L3,[1]Rank!$B$9:$B$782,[1]Rank!$F$9:$F$782)","v":"هيثم محمد أحمد شبانة"},668]
[3,"أحمد محمد حمدي صالح",396,null,null,"أحمد محمد حمدي صالح ",396,27,3,{"$f":"LOOKUP(L4,[1]Rank!$B$9:$B$782,[1]Rank!$E$9:$E$782)","v":"*"},{"$f":"LOOKUP(L4,[1]Rank!$B$9:$B$782,[1]Rank!$F$9:$F$782)","v":"هيثم عباس عبد الباري العشماوي"},300]
[4,"أحمد جميل السيد",368,null,null,"أحمد جميل السيد  ",368,10,4,{"$f":"LOOKUP(L5,[1]Rank!$B$9:$B$782,[1]Rank!$E$9:$E$782)","v":"*"},{"$f":"LOOKUP(L5,[1]Rank!$B$9:$B$782,[1]Rank!$F$9:$F$782)","v":"أحمد إبراهيم غانم  "},366]
[5,"أحمد محمد أمين",358,2,null,"أحمد محمد أمين  ",358,28,5,{"$f":"LOOKUP(L6,[1]Rank!$B$9:$B$782,[1]Rank!$E$9:$E$782)","v":"*"},{"$f":"LOOKUP(L6,[1]Rank!$B$9:$B$782,[1]Rank!$F$9:$F$782)","v":"يوسف مسعد فراج"},735]
[6,"معتز محمد عبد المنعم",351,null,null,"معتز محمد محمد عبد المنعم محمد",351,9,6,{"$f":"LOOKUP(L7,[1]Rank!$B$9:$B$782,[1]Rank!$E$9:$E$782)","v":"*"},{"$f":"LOOKUP(L7,[1]Rank!$B$9:$B$782,[1]Rank!$F$9:$F$782)","v":"محمد حسن عبد القادر إبراهيم حسن"},310]
[7,"هيثم محمد شبانة",668,null,null,"هيثم محمد أحمد شبانة",668,2,7,{"$f":"LOOKUP(L8,[1]Rank!$B$9:$B$782,[1]Rank!$E$9:$E$782)","v":"*"},{"$f":"LOOKUP(L8,[1]Rank!$B$9:$B$782,[1]Rank!$F$9:$F$782)","v":"أمير محمد خطاب"},200]
[8,"عبد الرحمن محمود عثمان",596,null,null,{"$error":"#N/A"},0,12,8,{"$f":"LOOKUP(L9,[1]Rank!$B$9:$B$782,[1]Rank!$E$9:$E$782)","v":"*"},{"$f":"LOOKUP(L9,[1]Rank!$B$9:$B$782,[1]Rank!$F$9:$F$782)","v":"علاء شوقي جبريل  "},361]
[9," عمرو محمد مصطفى","--",3,null,"طارق عبد الغني محمد السحار",671,26,9,{"$f":"LOOKUP(L10,[1]Rank!$B$9:$B$782,[1]Rank!$E$9:$E$782)","v":"*"},{"$f":"LOOKUP(L10,[1]Rank!$B$9:$B$782,[1]Rank!$F$9:$F$782)","v":"معتز محمد محمد عبد المنعم محمد"},351]
{"$rows_left_out":154}
{"sheet":"Score","index":1,"n_rows":164,"n_cols":37,"rows_kept":164,"cut":false,"hidden":false,"merged":[[72,0,75,0],[76,0,79,0],[80,0,83,0],[48,0,51,0],[52,0,55,0],[56,0,59,0],[60,0,63,0],[64,0,67,0],[68,0,71,0],[0,34,0,36],[28,0,31,0],[32,0,35,0],[36,0,39,0],[40,0,43,0],[0,0,0,3],[2,26,2,35],[2,22,3,22],[2,36,3,36],[4,0,7,0],[8,0,11,0],[0,6,0,15],[0,16,0,22],[44,0,47,0],[2,21,3,21],[2,2,3,2],[2,8,3,8],[2,14,3,14],[12,0,15,0],[2,9,3,9],[16,0,19,0],[2,4,2,7],[20,0,23,0],[2,10,2,13],[2,16,2,19],[2,15,3,15],[24,0,27,0],[2,3,3,3],[2,0,3,1],[84,0,87,0],[88,0,91,0],[92,0,95,0],[96,0,99,0],[100,0,103,0],[104,0,107,0],[108,0,111,0],[112,0,115,0],[116,0,119,0],[120,0,123,0],[124,0,127,0],[128,0,131,0],[132,0,135,0],[136,0,139,0],[140,0,143,0],[160,0,163,0],[144,0,147,0],[148,0,151,0],[152,0,155,0],[156,0,159,0]]}
[null,null,null,null,null,null,"ESTIMATION",null,null,null,null,null,null,null,null,null,"بطولة الاتحاد الثامنة للفردي المفتوح",null,null,null,null,null,null,null,null,null,"Date :",null,null,null,null,null,null,null,"2023-06-17"]
[]
["Tabel",null,"P.","Names","Round ( 1 )",null,null,null,"P.","Names","Round ( 2 )",null,null,null,"P.","Names","Round ( 3 )",null,null,null,null,"P. No.","Names",null,null,null,"F  I  N  A  L",null,null,null,null,null,null,null,null,null,"R."]
[null,null,null,null,"Score","Tab","Axe","TOT",null,null,"Score","Tab","Axe","TOT",null,null,"Score","Tab","Axe","TOT",null,null,null,1,2,3,"Score",1,2,3,"Tab",1,2,3,"Axe","TOT"]
["Tabel ( 1 )","N",1,{"$f":"LOOKUP(C5,Names!$A$2:$A$161,Names!$B$2:$B$161)","v":"إبراهيم عرفان السقا"},135,2.85,8,{"$f":"F5+G5","v":10.85},1,{"$f":"LOOKUP(I5,Names!$A$2:$A$161,Names!$B$2:$B$161)","v":"إبراهيم عرفان السقا"},165,4.75,10.5,{"$f":"L5+M5","v":15.25},1,{"$f":"LOOKUP(O5,Names!$A$2:$A$161,Names!$B$2:$B$161)","v":"إبراهيم عرفان السقا"},166,2.85,11,{"$f":"R5+S5","v":13.85},null,27,{"$f":"LOOKUP(V5,Names!$A$2:$A$161,Names!$B$2:$B$161)","v":"أحمد سمير خلف على"},{"$f":"IF(ISNA(VLOOKUP(V5,$C$5:$H$164,3,FALSE))=TRUE,\"\",VLOOKUP(V5,$C$5:$H$164,3,FALSE))","v":191},{"$f":"IF(ISNA(VLOOKUP(V5,$I$5:$N$164,3,FALSE))=TRUE,\"\",VLOOKUP(V5,$I$5:$N$164,3,FALSE))","v":233},{"$f":"IF(ISNA(VLOOKUP(V5,$O$5:$T$164,3,FALSE))=TRUE,\"\",VLOOKUP(V5,$O$5:$T$164,3,FALSE))","v":186},{"$f":"SUM(X5:Z5)","v":610},{"$f":"IF(ISNA(VLOOKUP(V5,$C$5:$H$164,4,FALSE))=TRUE,\"\",VLOOKUP(V5,$C$5:$H$164,4,FALSE))","v":4.75},{"$f":"IF(ISNA(VLOOKUP(V5,$I$5:$N$164,4,FALSE))=TRUE,\"\",VLOOKUP(V5,$I$5:$N$164,4,FALSE))","v":4.75},{"$f":"IF(ISNA(VLOOKUP(V5,$O$5:$T$164,4,FALSE))=TRUE,\"\",VLOOKUP(V5,$O$5:$T$164,4,FALSE))","v":4.75},{"$f":"SUM(AB5:AD5)","v":14.25},{"$f":"IF(ISNA(VLOOKUP(V5,$C$5:$H$164,5,FALSE))=TRUE,\"\",VLOOKUP(V5,$C$5:$H$164,5,FALSE))","v":15},{"$f":"IF(ISNA(VLOOKUP(V5,$I$5:$N$164,5,FALSE))=TRUE,\"\",VLOOKUP(V5,$I$5:$N$164,5,FALSE))","v":17},{"$f":"IF(ISNA(VLOOKUP(V5,$O$5:$T$164,5,FALSE))=TRUE,\"\",VLOOKUP(V5,$O$5:$T$164,5,FALSE))","v":16},{"$f":"SUM(AF5:AH5)","v":48},{"$f":"AE5+AI5","v":62.25},1]
[null,"W",17,{"$f":"LOOKUP(C6,Names!$A$2:$A$161,Names!$B$2:$B$161)","v":"مينا ناجح صبحي"},114,0,6,6,5,{"$f":"LOOKUP(I6,Names!$A$2:$A$161,Names!$B$2:$B$161)","v":"أحمد محمد أمين"},154,2.85,13,15.85,2,{"$f":"LOOKUP(O6,Names!$A$2:$A$161,Names!$B$2:$B$161)","v":"مصطفى محمد علي شرف"},135,0,4,4,null,104,{"$f":"LOOKUP(V6,Names!$A$2:$A$161,Names!$B$2:$B$161)","v":"كريم إيهاب عامر"},200,221,186,607,4.75,4.75,4.75,14.25,19,14,14,47,61.25,2]
[null,"S",33,{"$f":"LOOKUP(C7,Names!$A$2:$A$161,Names!$B$2:$B$161)","v":"أحمد إبراهيم غانم"},224,4.75,19,23.75,9,{"$f":"LOOKUP(I7,Names!$A$2:$A$161,Names!$B$2:$B$161)","v":" عمرو محمد مصطفى"},68,0,3,3,3,{"$f":"LOOKUP(O7,Names!$A$2:$A$161,Names!$B$2:$B$161)","v":"أحمد محمد حمدي صالح"},187,4.75,17,21.75,null,87,{"$f":"LOOKUP(V7,Names!$A$2:$A$161,Names!$B$2:$B$161)","v":"ياسر شاهين"},216,160,370,746,4.75,1.9000000000000001,4.75,11.4,17,12,19,48,59.4,3]
[null,"E",14,{"$f":"LOOKUP(C8,Names!$A$2:$A$161,Names!$B$2:$B$161)","v":"أحمد محمد محمدي"},133,1.9000000000000001,10,11.9,13,{"$f":"LOOKUP(I8,Names!$A$2:$A$161,Names!$B$2:$B$161)","v":"عمرو سمير دسوقي"},143,1.9000000000000001,10,11.9,4,{"$f":"LOOKUP(O8,Names!$A$2:$A$161,Names!$B$2:$B$161)","v":"أحمد جميل السيد"},149,1.9000000000000001,10,11.9,null,33,{"$f":"LOOKUP(V8,Names!$A$2:$A$161,Names!$B$2:$B$161)","v":"أحمد إبراهيم غانم"},224,165,176,565,4.75,2.85,4.75,12.35,19,10.5,12,41.5,53.85,4]
["Tabel ( 2 )","N",30,{"$f":"LOOKUP(C9,Names!$A$2:$A$161,Names!$B$2:$B$161)","v":"محمد سعيد الفطاطري"},176,2.85,14,16.850000000000001,17,{"$f":"LOOKUP(I9,Names!$A$2:$A$161,Names!$B$2:$B$161)","v":"مينا ناجح صبحي"},228,4.75,16,20.75,5,{"$f":"LOOKUP(O9,Names!$A$2:$A$161,Names!$B$2:$B$161)","v":"أحمد محمد أمين"},51,0,2,2,null,97,{"$f":"LOOKUP(V9,Names!$A$2:$A$161,Names!$B$2:$B$161)","v":"خالد محمد شبارة"},200,167,167,534,4.75,1.9000000000000001,4.75,11.4,19,12,11,42,53.4,5]
[null,"W",11,{"$f":"LOOKUP(C10,Names!$A$2:$A$161,Names!$B$2:$B$161)","v":"هيثم العشماوي"},100,1.9000000000000001,2,3.9000000000000004,21,{"$f":"LOOKUP(I10,Names!$A$2:$A$161,Names!$B$2:$B$161)","v":"محمد طارق عبد الله"},102,1.9000000000000001,1,2.9000000000000004,6,{"$f":"LOOKUP(O10,Names!$A$2:$A$161,Names!$B$2:$B$161)","v":"معتز محمد عبد المنعم"},163,2.85,9,11.85,null,113,{"$f":"LOOKUP(V10,Names!$A$2:$A$161,Names!$B$2:$B$161)","v":"محمد حسن فهيم"},187,181,159,527,4.75,2.85,2.85,10.45,16.5,13,12,41.5,51.95,6]
{"$rows_left_out":155}
{"sheet":"R1","index":2,"n_rows":108,"n_cols":28,"rows_kept":108,"cut":false,"hidden":false,"merged":[[2,11,2,17],[34,24,34,26],[40,3,40,5],[40,10,40,12],[40,17,40,19],[40,24,40,26],[34,3,34,5],[34,10,34,12],[34,17,34,19],[27,3,27,5],[27,10,27,12],[21,17,21,19],[27,17,27,19],[27,24,27,26],[21,10,21,12],[21,3,21,5],[21,24,21,26],[66,24,66,26],[66,3,66,5],[66,10,66,12],[66,17,66,19],[65,10,65,19],[58,24,58,26],[46,3,46,5],[46,10,46,12],[46,17,46,19],[46,24,46,26],[52,24,52,26],[58,3,58,5],[58,10,58,12],[58,17,58,19],[52,3,52,5],[52,10,52,12],[52,17,52,19],[15,3,15,5],[9,3,9,5],[0,24,2,26],[15,24,15,26],[9,24,9,26],[15,17,15,19],[9,17,9,19],[9,10,9,12],[15,10,15,12],[3,3,3,5],[3,10,3,12],[3,17,3,19],[3,24,3,26],[0,11,0,17]]}
[null,null,null,null,null,null,null,null,null,null,null,"Round ( 1 )",null,null,null,null,null,null,null,null,null,null,null,null,{"$f":"Score!Q1","v":"بطولة الاتحاد الثامنة للفردي المفتوح"}]
[]
[null,null,null,null,null,null,null,null,null,null,null,"Tab."]
[null,null,null,1,null,null,null,null,null,null,2,null,null,null,null,null,null,3,null,null,null,null,null,null,4]
[null,null,null,"Names","Sc.","Tab",null,null,null,null,"Names","Sc.","Tab",null,null,null,null,"Names","Sc.","Tab",null,null,null,null,"Names","Sc.","Tab"]
["N",1,{"$f":"Score!C5","v":1},{"$f":"LOOKUP(C6,Names!$A$2:$A$161,Names!$B$2:$B$161)","v":"إبراهيم عرفان السقا"},135,{"$f":"Sheet1!$M$5","v":2.85},{"$f":"F69","v":8},"N",1,{"$f":"Score!C9","v":30},{"$f":"LOOKUP(J6,Names!$A$2:$A$161,Names!$B$2:$B$161)","v":"محمد سعيد الفطاطري"},176,{"$f":"Sheet1!$M$5","v":2.85},{"$f":"F70","v":14},"N",1,{"$f":"Score!C13","v":24},{"$f":"LOOKUP(Q6,Names!$A$2:$A$161,Names!$B$2:$B$161)","v":"يامن محمد حسن"},96,{"$f":"Sheet1!$M$7","v":0},{"$f":"F71","v":2},"N",1,{"$f":"Score!C17","v":21},{"$f":"LOOKUP(X6,Names!$A$2:$A$161,Names!$B$2:$B$161)","v":"محمد طارق عبد الله"},187,{"$f":"Sheet1!$M$4","v":4.75},{"$f":"F72","v":16.5}]
["W",2,{"$f":"Score!C6","v":17},{"$f":"LOOKUP(C7,Names!$A$2:$A$161,Names!$B$2:$B$161)","v":"مينا ناجح صبحي"},114,{"$f":"Sheet1!$M$7","v":0},{"$f":"M69","v":6},"W",2,{"$f":"Score!C10","v":11},{"$f":"LOOKUP(J7,Names!$A$2:$A$161,Names!$B$2:$B$161)","v":"هيثم العشماوي"},100,{"$f":"Sheet1!$M$6","v":1.9000000000000001},{"$f":"M70","v":2},"W",2,{"$f":"Score!C14","v":5},{"$f":"LOOKUP(Q7,Names!$A$2:$A$161,Names!$B$2:$B$161)","v":"أحمد محمد أمين"},98,{"$f":"Sheet1!$M$6","v":1.9000000000000001},{"$f":"M71","v":1},"W",2,{"$f":"Score!C18","v":34},{"$f":"LOOKUP(X7,Names!$A$2:$A$161,Names!$B$2:$B$161)","v":"شريف حلمي"},182,{"$f":"Sheet1!$M$5","v":2.85},{"$f":"M72","v":16}]
["S",3,{"$f":"Score!C7","v":33},{"$f":"LOOKUP(C8,Names!$A$2:$A$161,Names!$B$2:$B$161)","v":"أحمد إبراهيم غانم"},224,{"$f":"Sheet1!$M$4","v":4.75},{"$f":"T69","v":19},"S",3,{"$f":"Score!C11","v":27},{"$f":"LOOKUP(J8,Names!$A$2:$A$161,Names!$B$2:$B$161)","v":"أحمد سمير خلف على"},191,{"$f":"Sheet1!$M$4","v":4.75},{"$f":"T70","v":15},"S",3,{"$f":"Score!C15","v":18},{"$f":"LOOKUP(Q8,Names!$A$2:$A$161,Names!$B$2:$B$161)","v":"وليد شعبان إسماعيل علي"},136,{"$f":"Sheet1!$M$5","v":2.85},{"$f":"T71","v":8},"S",3,{"$f":"Score!C19","v":15},{"$f":"LOOKUP(X8,Names!$A$2:$A$161,Names!$B$2:$B$161)","v":"حسام الدين صلاح أبو الفتوح"},134,{"$f":"Sheet1!$M$6","v":1.9000000000000001},{"$f":"T72","v":7}]
["E",4,{"$f":"Score!C8","v":14},{"$f":"LOOKUP(C9,Names!$A$2:$A$161,Names!$B$2:$B$161)","v":"أحمد محمد محمدي"},133,{"$f":"Sheet1!$M$6","v":1.9000000000000001},{"$f":"AA69","v":10},"E",4,{"$f":"Score!C12","v":8},{"$f":"LOOKUP(J9,Names!$A$2:$A$161,Names!$B$2:$B$161)","v":"عبد الرحمن محمود عثمان"},95,{"$f":"Sheet1!$M$7","v":0},{"$f":"AA70","v":2.5},"E",4,{"$f":"Score!C16","v":2},{"$f":"LOOKUP(Q9,Names!$A$2:$A$161,Names!$B$2:$B$161)","v":"مصطفى محمد علي شرف"},144,{"$f":"Sheet1!$M$4","v":4.75},{"$f":"AA71","v":11},"E",4,{"$f":"Score!C20","v":31},{"$f":"LOOKUP(X9,Names!$A$2:$A$161,Names!$B$2:$B$161)","v":"أحمد بسيوني"},104,{"$f":"Sheet1!$M$7","v":0},{"$f":"AA72","v":6}]
[null,null,null,5,null,null,null,null,null,null,6,null,null,null,null,null,null,7,null,null,null,null,null,null,8]
{"$rows_left_out":99}
{"sheet":"R2","index":3,"n_rows":108,"n_cols":31,"rows_kept":108,"cut":false,"hidden":false,"merged":[[58,24,58,26],[40,3,40,5],[40,10,40,12],[40,17,40,19],[40,24,40,26],[46,3,46,5],[46,10,46,12],[46,17,46,19],[46,24,46,26],[27,3,27,5],[27,10,27,12],[27,17,27,19],[27,24,27,26],[66,3,66,5],[66,10,66,12],[66,17,66,19],[66,24,66,26],[52,3,52,5],[52,10,52,12],[52,17,52,19],[52,24,52,26],[65,10,65,19],[58,3,58,5],[58,10,58,12],[58,17,58,19],[34,3,34,5],[34,10,34,12],[34,17,34,19],[34,24,34,26],[9,3,9,5],[9,10,9,12],[9,17,9,19],[9,24,9,26],[15,3,15,5],[15,10,15,12],[15,17,15,19],[15,24,15,26],[21,3,21,5],[21,10,21,12],[21,17,21,19],[21,24,21,26],[0,24,2,26],[3,3,3,5],[3,10,3,12],[3,17,3,19],[3,24,3,26],[0,11,0,17],[2,11,2,17]]}
[null,null,null,null,null,null,null,null,null,null,null,"Round ( 2 )",null,null,null,null,null,null,null,null,null,null,null,null,{"$f":"Score!Q1","v":"بطولة الاتحاد الثامنة للفردي المفتوح"}]
[]
[null,null,null,null,null,null,null,null,null,null,null,"Tab."]
[null,null,null,1,null,null,null,null,null,null,2,null,null,null,null,null,null,3,null,null,null,null,null,null,4]
[null,null,null,"Names","Sc.","Tab",null,null,null,null,"Names","Sc.","Tab",null,null,null,null,"Names","Sc.","Tab",null,null,null,null,"Names","Sc.","Tab"]
["N",1,{"$f":"Score!I5","v":1},{"$f":"LOOKUP(C6,Names!$A$2:$A$161,Names!$B$2:$B$161)","v":"إبراهيم عرفان السقا"},165,{"$f":"Sheet1!$M$4","v":4.75},{"$f":"F69","v":10.5},"N",1,{"$f":"Score!I9","v":17},{"$f":"LOOKUP(J6,Names!$A$2:$A$161,Names!$B$2:$B$161)","v":"مينا ناجح صبحي"},228,{"$f":"Sheet1!$M$4","v":4.75},{"$f":"F70","v":16},"N",1,{"$f":"Score!I13","v":33},{"$f":"LOOKUP(Q6,Names!$A$2:$A$161,Names!$B$2:$B$161)","v":"أحمد إبراهيم غانم"},165,{"$f":"Sheet1!$M$5","v":2.85},{"$f":"F71","v":10.5},"N",1,{"$f":"Score!I17","v":14},{"$f":"LOOKUP(X6,Names!$A$2:$A$161,Names!$B$2:$B$161)","v":"أحمد محمد محمدي"},146,{"$f":"Sheet1!$M$6","v":1.9000000000000001},{"$f":"F72","v":6.5}]
["W",2,{"$f":"Score!I6","v":5},{"$f":"LOOKUP(C7,Names!$A$2:$A$161,Names!$B$2:$B$161)","v":"أحمد محمد أمين"},154,{"$f":"Sheet1!$M$5","v":2.85},{"$f":"M69","v":13},"W",2,{"$f":"Score!I10","v":21},{"$f":"LOOKUP(J7,Names!$A$2:$A$161,Names!$B$2:$B$161)","v":"محمد طارق عبد الله"},102,{"$f":"Sheet1!$M$6","v":1.9000000000000001},{"$f":"M70","v":1},"W",2,{"$f":"Score!I14","v":2},{"$f":"LOOKUP(Q7,Names!$A$2:$A$161,Names!$B$2:$B$161)","v":"مصطفى محمد علي شرف"},190,{"$f":"Sheet1!$M$4","v":4.75},{"$f":"M71","v":15},"W",2,{"$f":"Score!I18","v":18},{"$f":"LOOKUP(X7,Names!$A$2:$A$161,Names!$B$2:$B$161)","v":"وليد شعبان إسماعيل علي"},148,{"$f":"Sheet1!$M$5","v":2.85},{"$f":"M72","v":10}]
["S",3,{"$f":"Score!I7","v":9},{"$f":"LOOKUP(C8,Names!$A$2:$A$161,Names!$B$2:$B$161)","v":" عمرو محمد مصطفى"},68,{"$f":"Sheet1!$M$7","v":0},{"$f":"T69","v":3},"S",3,{"$f":"Score!I11","v":25},{"$f":"LOOKUP(J8,Names!$A$2:$A$161,Names!$B$2:$B$161)","v":"خالد حمدي محمد السيد"},127,{"$f":"Sheet1!$M$5","v":2.85},{"$f":"T70","v":9},"S",3,{"$f":"Score!I15","v":6},{"$f":"LOOKUP(Q8,Names!$A$2:$A$161,Names!$B$2:$B$161)","v":"معتز محمد عبد المنعم"},60,{"$f":"Sheet1!$M$7","v":0},{"$f":"T71","v":2},"S",3,{"$f":"Score!I19","v":22},{"$f":"LOOKUP(X8,Names!$A$2:$A$161,Names!$B$2:$B$161)","v":"يوسف مسعد فراج"},184,{"$f":"Sheet1!$M$4","v":4.75},{"$f":"T72","v":16}]
["E",4,{"$f":"Score!I8","v":13},{"$f":"LOOKUP(C9,Names!$A$2:$A$161,Names!$B$2:$B$161)","v":"عمرو سمير دسوقي"},143,{"$f":"Sheet1!$M$6","v":1.9000000000000001},{"$f":"AA69","v":10},"E",4,{"$f":"Score!I12","v":29},{"$f":"LOOKUP(J9,Names!$A$2:$A$161,Names!$B$2:$B$161)","v":"اسلام نصر الغنام"},29,{"$f":"Sheet1!$M$7","v":0},{"$f":"AA70","v":1},"E",4,{"$f":"Score!I16","v":10},{"$f":"LOOKUP(Q9,Names!$A$2:$A$161,Names!$B$2:$B$161)","v":"تامر تيمور شكري"},159,{"$f":"Sheet1!$M$6","v":1.9000000000000001},{"$f":"AA71","v":11},"E",4,{"$f":"Score!I20","v":26},{"$f":"LOOKUP(X9,Names!$A$2:$A$161,Names!$B$2:$B$161)","v":"علاء شوقي جبريل"},105,{"$f":"Sheet1!$M$7","v":0},{"$f":"AA72","v":5}]
[null,null,null,5,null,null,null,null,null,null,6,null,null,null,null,null,null,7,null,null,null,null,null,null,8]
{"$rows_left_out":99}
{"sheet":"R3","index":4,"n_rows":108,"n_cols":28,"rows_kept":108,"cut":false,"hidden":false,"merged":[[58,24,58,26],[40,3,40,5],[40,10,40,12],[40,17,40,19],[40,24,40,26],[46,3,46,5],[46,10,46,12],[46,17,46,19],[46,24,46,26],[27,3,27,5],[27,10,27,12],[27,17,27,19],[27,24,27,26],[66,3,66,5],[66,10,66,12],[66,17,66,19],[66,24,66,26],[52,3,52,5],[52,10,52,12],[52,17,52,19],[52,24,52,26],[65,10,65,19],[58,3,58,5],[58,10,58,12],[58,17,58,19],[34,3,34,5],[34,10,34,12],[34,17,34,19],[34,24,34,26],[9,3,9,5],[9,10,9,12],[9,17,9,19],[9,24,9,26],[15,3,15,5],[15,10,15,12],[15,17,15,19],[15,24,15,26],[21,3,21,5],[21,10,21,12],[21,17,21,19],[21,24,21,26],[0,24,2,26],[3,3,3,5],[3,10,3,12],[3,17,3,19],[3,24,3,26],[0,11,0,17],[2,11,2,17]]}
[null,null,null,null,null,null,null,null,null,null,null,"Round ( 3 )",null,null,null,null,null,null,null,null,null,null,null,null,{"$f":"Score!Q1","v":"بطولة الاتحاد الثامنة للفردي المفتوح"}]
[]
[null,null,null,null,null,null,null,null,null,null,null,"Tab."]
[null,null,null,1,null,null,null,null,null,null,2,null,null,null,null,null,null,3,null,null,null,null,null,null,4]
[null,null,null,"Names","Sc.","Tab",null,null,null,null,"Names","Sc.","Tab",null,null,null,null,"Names","Sc.","Tab",null,null,null,null,"Names","Sc.","Tab"]
["N",1,{"$f":"Score!O5","v":1},{"$f":"LOOKUP(C6,Names!$A$2:$A$161,Names!$B$2:$B$161)","v":"إبراهيم عرفان السقا"},166,{"$f":"Sheet1!$M$5","v":2.85},{"$f":"F69","v":11},"N",1,{"$f":"Score!O9","v":5},{"$f":"LOOKUP(J6,Names!$A$2:$A$161,Names!$B$2:$B$161)","v":"أحمد محمد أمين"},51,{"$f":"Sheet1!$M$7","v":0},{"$f":"F70","v":2},"N",1,{"$f":"Score!O13","v":9},{"$f":"LOOKUP(Q6,Names!$A$2:$A$161,Names!$B$2:$B$161)","v":" عمرو محمد مصطفى"},82,{"$f":"Sheet1!$M$6","v":1.9000000000000001},{"$f":"F71","v":4},"N",1,{"$f":"Score!O17","v":13},{"$f":"LOOKUP(X6,Names!$A$2:$A$161,Names!$B$2:$B$161)","v":"عمرو سمير دسوقي"},115,{"$f":"Sheet1!$M$7","v":0},{"$f":"F72","v":7}]
["W",2,{"$f":"Score!O6","v":2},{"$f":"LOOKUP(C7,Names!$A$2:$A$161,Names!$B$2:$B$161)","v":"مصطفى محمد علي شرف"},135,{"$f":"Sheet1!$M$7","v":0},{"$f":"M69","v":4},"W",2,{"$f":"Score!O10","v":6},{"$f":"LOOKUP(J7,Names!$A$2:$A$161,Names!$B$2:$B$161)","v":"معتز محمد عبد المنعم"},163,{"$f":"Sheet1!$M$5","v":2.85},{"$f":"M70","v":9},"W",2,{"$f":"Score!O14","v":10},{"$f":"LOOKUP(Q7,Names!$A$2:$A$161,Names!$B$2:$B$161)","v":"تامر تيمور شكري"},43,{"$f":"Sheet1!$M$7","v":0},{"$f":"M71","v":1},"W",2,{"$f":"Score!O18","v":14},{"$f":"LOOKUP(X7,Names!$A$2:$A$161,Names!$B$2:$B$161)","v":"أحمد محمد محمدي"},154,3.8,{"$f":"M72","v":7}]
["S",3,{"$f":"Score!O7","v":3},{"$f":"LOOKUP(C8,Names!$A$2:$A$161,Names!$B$2:$B$161)","v":"أحمد محمد حمدي صالح"},187,{"$f":"Sheet1!$M$4","v":4.75},{"$f":"T69","v":17},"S",3,{"$f":"Score!O11","v":7},{"$f":"LOOKUP(J8,Names!$A$2:$A$161,Names!$B$2:$B$161)","v":"هيثم محمد شبانة"},180,{"$f":"Sheet1!$M$4","v":4.75},{"$f":"T70","v":14},"S",3,{"$f":"Score!O15","v":11},{"$f":"LOOKUP(Q8,Names!$A$2:$A$161,Names!$B$2:$B$161)","v":"هيثم العشماوي"},230,{"$f":"Sheet1!$M$4","v":4.75},{"$f":"T71","v":19},"S",3,{"$f":"Score!O19","v":15},{"$f":"LOOKUP(X8,Names!$A$2:$A$161,Names!$B$2:$B$161)","v":"حسام الدين صلاح أبو الفتوح"},144,{"$f":"Sheet1!$M$6","v":1.9000000000000001},{"$f":"T72","v":11}]
["E",4,{"$f":"Score!O8","v":4},{"$f":"LOOKUP(C9,Names!$A$2:$A$161,Names!$B$2:$B$161)","v":"أحمد جميل السيد"},149,{"$f":"Sheet1!$M$6","v":1.9000000000000001},{"$f":"AA69","v":10},"E",4,{"$f":"Score!O12","v":8},{"$f":"LOOKUP(J9,Names!$A$2:$A$161,Names!$B$2:$B$161)","v":"عبد الرحمن محمود عثمان"},101,{"$f":"Sheet1!$M$6","v":1.9000000000000001},{"$f":"AA70","v":3},"E",4,{"$f":"Score!O16","v":12},{"$f":"LOOKUP(Q9,Names!$A$2:$A$161,Names!$B$2:$B$161)","v":"أحمد علي السيد شرع"},128,{"$f":"Sheet1!$M$5","v":2.85},{"$f":"AA71","v":6},"E",4,{"$f":"Score!O20","v":16},{"$f":"LOOKUP(X9,Names!$A$2:$A$161,Names!$B$2:$B$161)","v":"طارق عبد الغني السحار"},154,3.8,{"$f":"AA72","v":12}]
[null,null,null,5,null,null,null,null,null,null,6,null,null,null,null,null,null,7,null,null,null,null,null,null,8]
{"$rows_left_out":99}
{"sheet":"Sheet1","index":5,"n_rows":82,"n_cols":15,"rows_kept":82,"cut":false,"hidden":false,"merged":[[46,0,49,0],[2,0,5,0],[6,0,9,0],[10,0,13,0],[14,0,17,0],[18,0,21,0],[22,0,25,0],[26,0,29,0],[30,0,33,0],[34,0,37,0],[38,0,41,0],[42,0,45,0],[74,0,77,0],[78,0,81,0],[50,0,53,0],[54,0,57,0],[58,0,61,0],[62,0,65,0],[66,0,69,0],[70,0,73,0]]}
[]
[]
[1,81,1,null,1,{"$f":"LOOKUP(E3,$C$3:$C$82,$B$3:$B$82)","v":81},null,1,1,null,null,{"$f":"$M$3+1","v":19},18,"عدد الطاولات"]
[null,82,2,null,17,{"$f":"LOOKUP(E4,$C$3:$C$82,$B$3:$B$82)","v":97},null,2,2,null,null,{"$f":"L3-2","v":17},{"$f":"N4*($M$3+1)","v":4.75},0.25,"الأول"]
[null,83,3,null,33,113,null,3,3,null,null,{"$f":"L4-1","v":16},{"$f":"N5*($M$3+1)","v":2.85},0.15,"الثاني"]
[null,84,4,null,14,94,null,4,4,null,null,15,1.9000000000000001,0.1,"الثالث"]
[2,85,5,null,30,110,null,5,5,null,null,14,0,0,"الرابع"]
[null,86,6,null,11,91,null,6,6,null,null,13]
[null,87,7,null,27,107,null,7,7,null,null,12]
[null,88,8,null,8,88,null,8,8,null,null,11]
{"$rows_left_out":73}
{"sheet":"MP_PP","index":6,"n_rows":162,"n_cols":6,"rows_kept":162,"cut":false,"hidden":false,"merged":[[0,0,1,0],[0,1,1,1],[0,2,1,2],[0,3,1,3]]}
["P. No.","Names","رقم العضوية","R."]
[]
[27,{"$f":"LOOKUP(A3,Names!$A$2:$A$161,Names!$B$2:$B$161)","v":"أحمد سمير خلف على"},{"$f":"LOOKUP(A3,Names!$A$2:$A$161,Names!$C$2:$C$161)","v":706},1,400,4]
[104,{"$f":"LOOKUP(A4,Names!$A$2:$A$161,Names!$B$2:$B$161)","v":"كريم إيهاب عامر"},{"$f":"LOOKUP(A4,Names!$A$2:$A$161,Names!$C$2:$C$161)","v":606},2,320,2]
[87,{"$f":"LOOKUP(A5,Names!$A$2:$A$161,Names!$B$2:$B$161)","v":"ياسر شاهين"},{"$f":"LOOKUP(A5,Names!$A$2:$A$161,Names!$C$2:$C$161)","v":660},3,280,1]
[33,{"$f":"LOOKUP(A6,Names!$A$2:$A$161,Names!$B$2:$B$161)","v":"أحمد إبراهيم غانم"},{"$f":"LOOKUP(A6,Names!$A$2:$A$161,Names!$C$2:$C$161)","v":366},4,200]
[97,{"$f":"LOOKUP(A7,Names!$A$2:$A$161,Names!$B$2:$B$161)","v":"خالد محمد شبارة"},{"$f":"LOOKUP(A7,Names!$A$2:$A$161,Names!$C$2:$C$161)","v":6},5,186.12]
[113,{"$f":"LOOKUP(A8,Names!$A$2:$A$161,Names!$B$2:$B$161)","v":"محمد حسن فهيم"},{"$f":"LOOKUP(A8,Names!$A$2:$A$161,Names!$C$2:$C$161)","v":"جديد"},6,183.34]
[106,{"$f":"LOOKUP(A9,Names!$A$2:$A$161,Names!$B$2:$B$161)","v":"أحمد عبد العزيز العطار"},{"$f":"LOOKUP(A9,Names!$A$2:$A$161,Names!$C$2:$C$161)","v":572},7,180.56]
[114,{"$f":"LOOKUP(A10,Names!$A$2:$A$161,Names!$B$2:$B$161)","v":"احمد سردينة"},{"$f":"LOOKUP(A10,Names!$A$2:$A$161,Names!$C$2:$C$161)","v":317},8,177.78]
{"$rows_left_out":152}