{"text_format":"1","workbook":"xlsx","n_sheets":8,"sheets":["Names","Score","R1","R2","R3","R4","Sheet1","MP_PP"],"not_rendered":{"charts":0,"images":1,"macros":1,"external_links":4,"defined_names":5,"comments":0,"pivot_tables":0},"unopened":[],"bounds":{"document_bytes":16777216,"sheet_cells":100000,"rows_first":2000,"rows_last":500,"rows_between":2000,"halvings":0,"cell_chars":16384,"cell_head_chars":4096},"cells_cut":0,"cells_raw":0,"read":"whole","date_system":"1900"}

{"sheet":"Names","index":0,"n_rows":188,"n_cols":17,"rows_kept":188,"cut":false,"hidden":false,"merged":[[125,3,128,3],[129,3,132,3],[133,3,136,3],[137,3,140,3],[164,11,164,12],[141,3,144,3],[145,3,148,3],[149,3,152,3],[153,3,156,3],[157,3,160,3],[105,3,108,3],[109,3,112,3],[113,3,116,3],[117,3,120,3],[121,3,124,3],[85,3,88,3],[89,3,92,3],[93,3,96,3],[97,3,100,3],[101,3,104,3],[57,3,60,3],[61,3,64,3],[65,3,68,3],[69,3,72,3],[81,3,84,3],[73,3,76,3],[77,3,80,3],[49,3,52,3],[45,3,48,3],[1,3,4,3],[5,3,8,3],[9,3,12,3],[13,3,16,3],[17,3,20,3],[21,3,24,3],[25,3,28,3],[29,3,32,3],[33,3,36,3],[37,3,40,3],[41,3,44,3],[53,3,56,3]]}
[0,"Names",null,"Tab.",null,null,null,null,null,0,null,null,"LE","Ins","Vod"]
[1,"راجي صبحي  ",111,1,null,{"$f":"LOOKUP(H2,$I$2:$I$161,$K$2:$K$161)","v":"راجي محمد صبحي  "},{"$f":"LOOKUP(H2,$I$2:$I$161,$L$2:$L$161)","v":111},1,1,{"$f":"_xlfn.IFNA(LOOKUP(L2,[1]Rank!B$9:B$795,[1]Rank!E$9:E$795),\"\")","v":"*"},{"$f":"LOOKUP(L2,[2]الأسماء!A$3:A$962,[2]الأسماء!C$3:C$962)","v":"راجي محمد صبحي  "},111,{"$f":"SUM(N2:P2)","v":0},null,null,null,"راجي محمد صبحي  "]
[2,"شريف أحمد محمد حمروش",2003,null,null,"شريف أحمد محمد حمروش",{"$f":"LOOKUP(H3,$I$2:$I$161,$L$2:$L$161)","v":2003},11,2,{"$f":"_xlfn.IFNA(LOOKUP(L3,[1]Rank!B$9:B$795,[1]Rank!E$9:E$795),\"\")","v":"*"},{"$f":"LOOKUP(L3,[2]الأسماء!A$3:A$962,[2]الأسماء!C$3:C$962)","v":"باسم أسحق صموائيل عزيز "},516,{"$f":"SUM(N3:P3)","v":300},300,null,null,"باسم أسحق صموائيل عزيز "]
[3,"إيهاب يوسف عمارة ",756,null,null,"إيهاب يوسف عبد القادر عمارة ",756,27,3,{"$f":"_xlfn.IFNA(LOOKUP(L4,[1]Rank!B$9:B$795,[1]Rank!E$9:E$795),\"\")","v":0},"أمير كمال جميل",2001,300,300,null,null,"أمير كمال جميل"]
[4,"محمد سعيد الفطاطري",550,null,null,"محمد سعيد زكي محمد الفطاطري",550,10,4,{"$f":"_xlfn.IFNA(LOOKUP(L5,[1]Rank!B$9:B$795,[1]Rank!E$9:E$795),\"\")","v":"*"},{"$f":"LOOKUP(L5,[2]الأسماء!A$3:A$962,[2]الأسماء!C$3:C$962)","v":"أحمد محمد يوسف حجازي "},322,0,null,null,null,"أحمد محمد يوسف حجازي "]
[5,"محمد عصام الدين القاضي ",304,2,null,"أحمد مصطفى سعد أحمد راشد",306,28,5,{"$f":"_xlfn.IFNA(LOOKUP(L6,[1]Rank!B$9:B$795,[1]Rank!E$9:E$795),\"\")","v":0},"مصطفى يوسف محمد",2002,300,300,null,null,"مصطفى يوسف محمد"]
[6,"إبراهيم عرفان السقا  ",721,null,null,"إبراهيم عرفان السقا  ",721,9,6,{"$f":"_xlfn.IFNA(LOOKUP(L7,[1]Rank!B$9:B$795,[1]Rank!E$9:E$795),\"\")","v":"*"},{"$f":"LOOKUP(L7,[2]الأسماء!A$3:A$962,[2]الأسماء!C$3:C$962)","v":"عبد الرحمن محمود عبد السميع محمد عثمان"},596,0,null,null,null,"عبد الرحمن محمود عبد السميع محمد عثمان"]
[7,"باسم أسحق صموائيل",516,null,null,"باسم أسحق صموائيل عزيز ",516,2,7,{"$f":"_xlfn.IFNA(LOOKUP(L8,[1]Rank!B$9:B$795,[1]Rank!E$9:E$795),\"\")","v":"*"},{"$f":"LOOKUP(L8,[2]الأسماء!A$3:A$962,[2]الأسماء!C$3:C$962)","v":"أحمد شيرين محمود عز الدين بسيوني"},399,0,null,null,null,"أحمد شيرين محمود عز الدين بسيوني"]
{"$rows_left_out":181}
{"sheet":"Score","index":1,"n_rows":164,"n_cols":49,"rows_kept":164,"cut":false,"hidden":false,"merged":[[160,0,163,0],[144,0,147,0],[148,0,151,0],[152,0,155,0],[156,0,159,0],[124,0,127,0],[128,0,131,0],[132,0,135,0],[136,0,139,0],[140,0,143,0],[104,0,107,0],[108,0,111,0],[112,0,115,0],[116,0,119,0],[120,0,123,0],[84,0,87,0],[88,0,91,0],[92,0,95,0],[96,0,99,0],[100,0,103,0],[0,33,0,45],[0,19,0,27],[0,6,0,18],[44,0,47,0],[2,27,3,27],[2,2,3,2],[2,8,3,8],[2,14,3,14],[12,0,15,0],[2,9,3,9],[16,0,19,0],[2,4,2,7],[20,0,23,0],[2,10,2,13],[2,16,2,19],[2,15,3,15],[2,28,3,28],[2,45,3,45],[4,0,7,0],[8,0,11,0],[2,20,3,20],[2,21,3,21],[2,22,2,25],[2,33,2,44],[2,3,3,3],[2,0,3,1],[72,0,75,0],[76,0,79,0],[80,0,83,0],[48,0,51,0],[52,0,55,0],[56,0,59,0],[60,0,63,0],[64,0,67,0],[68,0,71,0],[28,0,31,0],[32,0,35,0],[36,0,39,0],[40,0,43,0],[0,0,0,3],[24,0,27,0]]}
[null,null,null,null,null,null,"ESTIMATION",null,null,null,null,null,null,null,null,null,null,null,null,"بطولة الجمهورية الثانية\nللفردي المفتوح",null,null,null,null,null,null,null,null,"Date :",null,null,null,null,"2024-06-28"]
[]
["Tabel",null,"P.","Names","Round ( 1 )",null,null,null,"P.","Names","Round ( 2 )",null,null,null,"P.","Names","Round ( 3 )",null,null,null,"P.","Names","Round ( 4 )",null,null,null,null,"P. No.","Names",null,null,null,null,"FINAL",null,null,null,null,null,null,null,null,null,null,null,"R."]
[null,null,null,null,"Score","Tab","Axe","TOT",null,null,"Score","Tab","Axe","TOT",null,null,"Score","Tab","Axe","TOT",null,null,"Score","Tab","Axe","TOT",null,null,null,1,2,3,4,"Score",1,2,3,4,"Tab",1,2,3,4,"Axe","TOT"]
["Tabel ( 1 )","N",1,{"$f":"LOOKUP(C5,Names!$A$2:$A$161,Names!$B$2:$B$161)","v":"راجي صبحي  "},95,0,10,{"$f":"F5+G5","v":10},1,{"$f":"LOOKUP(I5,Names!$A$2:$A$161,Names!$B$2:$B$161)","v":"راجي صبحي  "},47,0,1,{"$f":"L5+M5","v":1},1,{"$f":"LOOKUP(O5,Names!$A$2:$A$161,Names!$B$2:$B$161)","v":"راجي صبحي  "},76,0,6,{"$f":"R5+S5","v":6},1,{"$f":"LOOKUP(U5,Names!$A$2:$A$161,Names!$B$2:$B$161)","v":"راجي صبحي  "},89,0,10,{"$f":"X5+Y5","v":10},null,30,{"$f":"LOOKUP(AB5,Names!$A$2:$A$161,Names!$B$2:$B$161)","v":"شريف جلال سماحة "},{"$f":"IF(ISNA(VLOOKUP(AB5,$C$5:$H$164,3,FALSE))=TRUE,\"\",VLOOKUP(AB5,$C$5:$H$164,3,FALSE))","v":180},{"$f":"IF(ISNA(VLOOKUP(AB5,$I$5:$N$164,3,FALSE))=TRUE,\"\",VLOOKUP(AB5,$I$5:$N$164,3,FALSE))","v":216},{"$f":"IF(ISNA(VLOOKUP(AB5,$O$5:$T$164,3,FALSE))=TRUE,\"\",VLOOKUP(AB5,$O$5:$T$164,3,FALSE))","v":137},{"$f":"IF(ISNA(VLOOKUP(AB5,$U$5:$Z$164,3,FALSE))=TRUE,\"\",VLOOKUP(AB5,$U$5:$Z$164,3,FALSE))","v":127},{"$f":"SUM(AD5:AG5)","v":660},{"$f":"IF(ISNA(VLOOKUP(AB5,$C$5:$H$164,4,FALSE))=TRUE,\"\",VLOOKUP(AB5,$C$5:$H$164,4,FALSE))","v":0},{"$f":"IF(ISNA(VLOOKUP(AB5,$I$5:$N$164,4,FALSE))=TRUE,\"\",VLOOKUP(AB5,$I$5:$N$164,4,FALSE))","v":0},{"$f":"IF(ISNA(VLOOKUP(AB5,$O$5:$T$164,4,FALSE))=TRUE,\"\",VLOOKUP(AB5,$O$5:$T$164,4,FALSE))","v":0},{"$f":"IF(ISNA(VLOOKUP(AB5,$U$5:$Z$164,4,FALSE))=TRUE,\"\",VLOOKUP(AB5,$U$5:$Z$164,4,FALSE))","v":0},{"$f":"SUM(AI5:AL5)","v":0},{"$f":"IF(ISNA(VLOOKUP(AB5,$C$5:$H$164,5,FALSE))=TRUE,\"\",VLOOKUP(AB5,$C$5:$H$164,5,FALSE))","v":19},{"$f":"IF(ISNA(VLOOKUP(AB5,$I$5:$N$164,5,FALSE))=TRUE,\"\",VLOOKUP(AB5,$I$5:$N$164,5,FALSE))","v":21},{"$f":"IF(ISNA(VLOOKUP(AB5,$O$5:$T$164,5,FALSE))=TRUE,\"\",VLOOKUP(AB5,$O$5:$T$164,5,FALSE))","v":17},{"$f":"IF(ISNA(VLOOKUP(AB5,$U$5:$Z$164,5,FALSE))=TRUE,\"\",VLOOKUP(AB5,$U$5:$Z$164,5,FALSE))","v":16},{"$f":"SUM(AN5:AQ5)","v":73},{"$f":"AM5+AR5","v":73},1,null,1,{"$f":"AV5","v":1}]
[null,"W",2,{"$f":"LOOKUP(C6,Names!$A$2:$A$161,Names!$B$2:$B$161)","v":"شريف أحمد محمد حمروش"},65,0,7,7,21,{"$f":"LOOKUP(I6,Names!$A$2:$A$161,Names!$B$2:$B$161)","v":"أحمد محمد حمدي صالح "},112,0,7,7,78,{"$f":"LOOKUP(O6,Names!$A$2:$A$161,Names!$B$2:$B$161)","v":"حسام الخلفاوي"},8,0,1,1,70,{"$f":"LOOKUP(U6,Names!$A$2:$A$161,Names!$B$2:$B$161)","v":"أحمد صلاح الدين دياب "},67,0,4,4,null,59,{"$f":"LOOKUP(AB6,Names!$A$2:$A$161,Names!$B$2:$B$161)","v":"هشام أبوغربية "},195,162,104,163,624,0,0,0,0,0,19,19,12.5,19,69.5,69.5,2,null,70,{"$f":"AV6","v":70}]
[null,"S",3,{"$f":"LOOKUP(C7,Names!$A$2:$A$161,Names!$B$2:$B$161)","v":"إيهاب يوسف عمارة "},133,0,12,12,41,{"$f":"LOOKUP(I7,Names!$A$2:$A$161,Names!$B$2:$B$161)","v":"خالد مصطفى عزت "},97,0,13,13,11,{"$f":"LOOKUP(O7,Names!$A$2:$A$161,Names!$B$2:$B$161)","v":"معتز محمد مدبولي "},147,0,17.5,17.5,59,{"$f":"LOOKUP(U7,Names!$A$2:$A$161,Names!$B$2:$B$161)","v":"هشام أبوغربية "},163,0,19,19,null,73,{"$f":"LOOKUP(AB7,Names!$A$2:$A$161,Names!$B$2:$B$161)","v":"مينا ناجح صبحي  "},180,98,125,107,510,0,0,0,0,0,19,13,21,16,69,69,3,null,59,{"$f":"AV7","v":59}]
[null,"E",4,{"$f":"LOOKUP(C8,Names!$A$2:$A$161,Names!$B$2:$B$161)","v":"محمد سعيد الفطاطري"},103,0,14,14,61,{"$f":"LOOKUP(I8,Names!$A$2:$A$161,Names!$B$2:$B$161)","v":"كريم إيهاب عامر  "},116,0,17,17,8,{"$f":"LOOKUP(O8,Names!$A$2:$A$161,Names!$B$2:$B$161)","v":"إيهاب  محمد الزهيري "},160,0,21,21,48,{"$f":"LOOKUP(U8,Names!$A$2:$A$161,Names!$B$2:$B$161)","v":"محمد ناجي زاهر بلبع "},81,0,13,13,null,48,{"$f":"LOOKUP(AB8,Names!$A$2:$A$161,Names!$B$2:$B$161)","v":"محمد ناجي زاهر بلبع "},182,119,146,81,528,0,0,0,0,0,21,15.5,16,13,65.5,65.5,4,null,48,{"$f":"AV8","v":48}]
{"$rows_left_out":157}
{"sheet":"R1","index":2,"n_rows":108,"n_cols":28,"rows_kept":108,"cut":false,"hidden":false,"merged":[[52,10,52,12],[52,17,52,19],[15,3,15,5],[9,3,9,5],[0,24,2,26],[15,24,15,26],[9,24,9,26],[15,17,15,19],[9,17,9,19],[9,10,9,12],[15,10,15,12],[3,3,3,5],[3,10,3,12],[3,17,3,19],[3,24,3,26],[0,11,0,17],[21,24,21,26],[66,24,66,26],[66,3,66,5],[66,10,66,12],[66,17,66,19],[65,10,65,19],[58,24,58,26],[46,3,46,5],[46,10,46,12],[46,17,46,19],[46,24,46,26],[52,24,52,26],[58,3,58,5],[58,10,58,12],[58,17,58,19],[52,3,52,5],[2,11,2,17],[34,24,34,26],[40,3,40,5],[40,10,40,12],[40,17,40,19],[40,24,40,26],[34,3,34,5],[34,10,34,12],[34,17,34,19],[27,3,27,5],[27,10,27,12],[21,17,21,19],[27,17,27,19],[27,24,27,26],[21,10,21,12],[21,3,21,5]]}
[null,null,null,null,null,null,null,null,null,null,"التوقيت :","Round ( 1 )",null,null,null,null,null,null,null,null,null,null,null,null,{"$f":"Score!T1","v":"بطولة الجمهورية الثانية\nللفردي المفتوح"}]
[]
[null,null,null,null,null,null,null,null,null,null,"2.00 PM","Tab."]
[null,null,null,1,null,null,null,null,null,null,2,null,null,null,null,null,null,3,null,null,null,null,null,null,4]
[null,null,null,"Names","Sc.","Tab",null,null,null,null,"Names","Sc.","Tab",null,null,null,null,"Names","Sc.","Tab",null,null,null,null,"Names","Sc.","Tab"]
["N",1,{"$f":"Score!C5","v":1},{"$f":"LOOKUP(C6,Names!$A$2:$A$161,Names!$B$2:$B$161)","v":"راجي صبحي  "},95,{"$f":"Sheet1!$M$4","v":0},{"$f":"F69","v":21},"N",1,{"$f":"Score!C9","v":5},{"$f":"LOOKUP(J6,Names!$A$2:$A$161,Names!$B$2:$B$161)","v":"محمد عصام الدين القاضي "},136,{"$f":"Sheet1!$M$4","v":0},{"$f":"F70","v":19},"N",1,{"$f":"Score!C13","v":9},{"$f":"LOOKUP(Q6,Names!$A$2:$A$161,Names!$B$2:$B$161)","v":"رأفت الصياد"},36,{"$f":"Sheet1!$M$4","v":0},{"$f":"F71","v":18},"N",1,{"$f":"Score!C17","v":13},{"$f":"LOOKUP(X6,Names!$A$2:$A$161,Names!$B$2:$B$161)","v":"أحمد جميل السيد "},83,{"$f":"Sheet1!$M$4","v":0},{"$f":"F72","v":17}]
["W",2,{"$f":"Score!C6","v":2},{"$f":"LOOKUP(C7,Names!$A$2:$A$161,Names!$B$2:$B$161)","v":"شريف أحمد محمد حمروش"},65,{"$f":"Sheet1!$M$5","v":0},{"$f":"M69","v":21},"W",2,{"$f":"Score!C10","v":6},{"$f":"LOOKUP(J7,Names!$A$2:$A$161,Names!$B$2:$B$161)","v":"إبراهيم عرفان السقا  "},126,{"$f":"Sheet1!$M$5","v":0},{"$f":"M70","v":19},"W",2,{"$f":"Score!C14","v":10},{"$f":"LOOKUP(Q7,Names!$A$2:$A$161,Names!$B$2:$B$161)","v":"نبيل خلف زكي حسنين "},165,{"$f":"Sheet1!$M$5","v":0},{"$f":"M71","v":18},"W",2,{"$f":"Score!C18","v":14},{"$f":"LOOKUP(X7,Names!$A$2:$A$161,Names!$B$2:$B$161)","v":"عماد محمد فؤاد"},56,{"$f":"Sheet1!$M$5","v":0},{"$f":"M72","v":17}]
["S",3,{"$f":"Score!C7","v":3},{"$f":"LOOKUP(C8,Names!$A$2:$A$161,Names!$B$2:$B$161)","v":"إيهاب يوسف عمارة "},133,{"$f":"Sheet1!$M$6","v":0},{"$f":"T69","v":21},"S",3,{"$f":"Score!C11","v":7},{"$f":"LOOKUP(J8,Names!$A$2:$A$161,Names!$B$2:$B$161)","v":"باسم أسحق صموائيل"},87,{"$f":"Sheet1!$M$6","v":0},{"$f":"T70","v":19},"S",3,{"$f":"Score!C15","v":11},{"$f":"LOOKUP(Q8,Names!$A$2:$A$161,Names!$B$2:$B$161)","v":"معتز محمد مدبولي "},17,{"$f":"Sheet1!$M$6","v":0},{"$f":"T71","v":18},"S",3,{"$f":"Score!C19","v":15},{"$f":"LOOKUP(X8,Names!$A$2:$A$161,Names!$B$2:$B$161)","v":"أحمد رمزي الديب "},190,{"$f":"Sheet1!$M$6","v":0},{"$f":"T72","v":17}]
{"$rows_left_out":101}
{"sheet":"R2","index":3,"n_rows":108,"n_cols":28,"rows_kept":108,"cut":false,"hidden":false,"merged":[[0,24,2,26],[3,3,3,5],[3,10,3,12],[3,17,3,19],[3,24,3,26],[0,11,0,17],[2,11,2,17],[34,3,34,5],[34,10,34,12],[34,17,34,19],[34,24,34,26],[9,3,9,5],[9,10,9,12],[9,17,9,19],[9,24,9,26],[15,3,15,5],[15,10,15,12],[15,17,15,19],[15,24,15,26],[21,3,21,5],[21,10,21,12],[21,17,21,19],[21,24,21,26],[27,3,27,5],[27,10,27,12],[27,17,27,19],[27,24,27,26],[66,3,66,5],[66,10,66,12],[66,17,66,19],[66,24,66,26],[52,3,52,5],[52,10,52,12],[52,17,52,19],[52,24,52,26],[65,10,65,19],[58,3,58,5],[58,10,58,12],[58,17,58,19],[58,24,58,26],[40,3,40,5],[40,10,40,12],[40,17,40,19],[40,24,40,26],[46,3,46,5],[46,10,46,12],[46,17,46,19],[46,24,46,26]]}
[null,null,null,null,null,null,null,null,null,null,"التوقيت :","Round ( 2 )",null,null,null,null,null,null,null,null,null,null,null,null,{"$f":"Score!T1","v":"بطولة الجمهورية الثانية\nللفردي المفتوح"}]
[]
[null,null,null,null,null,null,null,null,null,null,"3.00 PM","Tab."]
[null,null,null,1,null,null,null,null,null,null,2,null,null,null,null,null,null,3,null,null,null,null,null,null,4]
[null,null,null,"Names","Sc.","Tab",null,null,null,null,"Names","Sc.","Tab",null,null,null,null,"Names","Sc.","Tab",null,null,null,null,"Names","Sc.","Tab"]
["N",1,{"$f":"Score!I5","v":1},{"$f":"LOOKUP(C6,Names!$A$2:$A$161,Names!$B$2:$B$161)","v":"راجي صبحي  "},47,{"$f":"Sheet1!$M$4","v":0},{"$f":"F69","v":21},"N",1,{"$f":"Score!I9","v":2},{"$f":"LOOKUP(J6,Names!$A$2:$A$161,Names!$B$2:$B$161)","v":"شريف أحمد محمد حمروش"},51,{"$f":"Sheet1!$M$4","v":0},{"$f":"F70","v":19},"N",1,{"$f":"Score!I13","v":3},{"$f":"LOOKUP(Q6,Names!$A$2:$A$161,Names!$B$2:$B$161)","v":"إيهاب يوسف عمارة "},108,{"$f":"Sheet1!$M$4","v":0},{"$f":"F71","v":18},"N",1,{"$f":"Score!I17","v":4},{"$f":"LOOKUP(X6,Names!$A$2:$A$161,Names!$B$2:$B$161)","v":"محمد سعيد الفطاطري"},190,{"$f":"Sheet1!$M$4","v":0},{"$f":"F72","v":17}]
["W",2,{"$f":"Score!I6","v":21},{"$f":"LOOKUP(C7,Names!$A$2:$A$161,Names!$B$2:$B$161)","v":"أحمد محمد حمدي صالح "},112,{"$f":"Sheet1!$M$5","v":0},{"$f":"M69","v":21},"W",2,{"$f":"Score!I10","v":22},{"$f":"LOOKUP(J7,Names!$A$2:$A$161,Names!$B$2:$B$161)","v":"طه إبراهيم طه  "},151,{"$f":"Sheet1!$M$5","v":0},{"$f":"M70","v":19},"W",2,{"$f":"Score!I14","v":23},{"$f":"LOOKUP(Q7,Names!$A$2:$A$161,Names!$B$2:$B$161)","v":"مصطفى يوسف محمد"},69,{"$f":"Sheet1!$M$5","v":0},{"$f":"M71","v":18},"W",2,{"$f":"Score!I18","v":24},{"$f":"LOOKUP(X7,Names!$A$2:$A$161,Names!$B$2:$B$161)","v":"هيثم محمد شبانة"},134,{"$f":"Sheet1!$M$5","v":0},{"$f":"M72","v":17}]
["S",3,{"$f":"Score!I7","v":41},{"$f":"LOOKUP(C8,Names!$A$2:$A$161,Names!$B$2:$B$161)","v":"خالد مصطفى عزت "},97,{"$f":"Sheet1!$M$6","v":0},{"$f":"T69","v":21},"S",3,{"$f":"Score!I11","v":42},{"$f":"LOOKUP(J8,Names!$A$2:$A$161,Names!$B$2:$B$161)","v":"محمد عبد الهادي أبو القاسم "},119,{"$f":"Sheet1!$M$6","v":0},{"$f":"T70","v":19},"S",3,{"$f":"Score!I15","v":43},{"$f":"LOOKUP(Q8,Names!$A$2:$A$161,Names!$B$2:$B$161)","v":"أمير محمد خطاب  "},49,{"$f":"Sheet1!$M$6","v":0},{"$f":"T71","v":18},"S",3,{"$f":"Score!I19","v":44},{"$f":"LOOKUP(X8,Names!$A$2:$A$161,Names!$B$2:$B$161)","v":"جمال السيد توفيق محمد "},22,{"$f":"Sheet1!$M$6","v":0},{"$f":"T72","v":17}]
{"$rows_left_out":101}
{"sheet":"R3","index":4,"n_rows":108,"n_cols":28,"rows_kept":108,"cut":false,"hidden":false,"merged":[[0,24,2,26],[3,3,3,5],[3,10,3,12],[3,17,3,19],[3,24,3,26],[0,11,0,17],[2,11,2,17],[34,3,34,5],[34,10,34,12],[34,17,34,19],[34,24,34,26],[9,3,9,5],[9,10,9,12],[9,17,9,19],[9,24,9,26],[15,3,15,5],[15,10,15,12],[15,17,15,19],[15,24,15,26],[21,3,21,5],[21,10,21,12],[21,17,21,19],[21,24,21,26],[27,3,27,5],[27,10,27,12],[27,17,27,19],[27,24,27,26],[66,3,66,5],[66,10,66,12],[66,17,66,19],[66,24,66,26],[52,3,52,5],[52,10,52,12],[52,17,52,19],[52,24,52,26],[65,10,65,19],[58,3,58,5],[58,10,58,12],[58,17,58,19],[58,24,58,26],[40,3,40,5],[40,10,40,12],[40,17,40,19],[40,24,40,26],[46,3,46,5],[46,10,46,12],[46,17,46,19],[46,24,46,26]]}
[null,null,null,null,null,null,null,null,null,null,"التوقيت :","Round ( 3 )",null,null,null,null,null,null,null,null,null,null,null,null,{"$f":"Score!T1","v":"بطولة الجمهورية الثانية\nللفردي المفتوح"}]
[]
[null,null,null,null,null,null,null,null,null,null,"4.00 PM","Tab."]
[null,null,null,1,null,null,null,null,null,null,2,null,null,null,null,null,null,3,null,null,null,null,null,null,4]
[null,null,null,"Names","Sc.","Tab",null,null,null,null,"Names","Sc.","Tab",null,null,null,null,"Names","Sc.","Tab",null,null,null,null,"Names","Sc.","Tab"]
["N",1,{"$f":"Score!O5","v":1},{"$f":"LOOKUP(C6,Names!$A$2:$A$161,Names!$B$2:$B$161)","v":"راجي صبحي  "},76,{"$f":"Sheet1!$M$4","v":0},{"$f":"F69","v":21},"N",1,{"$f":"Score!O9","v":2},{"$f":"LOOKUP(J6,Names!$A$2:$A$161,Names!$B$2:$B$161)","v":"شريف أحمد محمد حمروش"},113,{"$f":"Sheet1!$M$4","v":0},{"$f":"F70","v":19},"N",1,{"$f":"Score!O13","v":19},{"$f":"LOOKUP(Q6,Names!$A$2:$A$161,Names!$B$2:$B$161)","v":"إبراهيم عنتر  "},94,{"$f":"Sheet1!$M$4","v":0},{"$f":"F71","v":18},"N",1,{"$f":"Score!O17","v":33},{"$f":"LOOKUP(X6,Names!$A$2:$A$161,Names!$B$2:$B$161)","v":"أحمد بسيوني"},129,{"$f":"Sheet1!$M$4","v":0},{"$f":"F72","v":17}]
["W",2,{"$f":"Score!O6","v":78},{"$f":"LOOKUP(C7,Names!$A$2:$A$161,Names!$B$2:$B$161)","v":"حسام الخلفاوي"},8,{"$f":"Sheet1!$M$5","v":0},{"$f":"M69","v":21},"W",2,{"$f":"Score!O10","v":25},{"$f":"LOOKUP(J7,Names!$A$2:$A$161,Names!$B$2:$B$161)","v":"خالد شباره "},35,{"$f":"Sheet1!$M$5","v":0},{"$f":"M70","v":19},"W",2,{"$f":"Score!O14","v":16},{"$f":"LOOKUP(Q7,Names!$A$2:$A$161,Names!$B$2:$B$161)","v":"عبد الرحمن سعد موسى"},90,{"$f":"Sheet1!$M$5","v":0},{"$f":"M71","v":18},"W",2,{"$f":"Score!O18","v":10},{"$f":"LOOKUP(X7,Names!$A$2:$A$161,Names!$B$2:$B$161)","v":"نبيل خلف زكي حسنين "},12,{"$f":"Sheet1!$M$5","v":0},{"$f":"M72","v":17}]
["S",3,{"$f":"Score!O7","v":11},{"$f":"LOOKUP(C8,Names!$A$2:$A$161,Names!$B$2:$B$161)","v":"معتز محمد مدبولي "},147,{"$f":"Sheet1!$M$6","v":0},{"$f":"T69","v":21},"S",3,{"$f":"Score!O11","v":12},{"$f":"LOOKUP(J8,Names!$A$2:$A$161,Names!$B$2:$B$161)","v":"أمير كمال جميل"},147,{"$f":"Sheet1!$M$6","v":0},{"$f":"T70","v":19},"S",3,{"$f":"Score!O15","v":29},{"$f":"LOOKUP(Q8,Names!$A$2:$A$161,Names!$B$2:$B$161)","v":"عبد الرحمن عثمان"},39,{"$f":"Sheet1!$M$6","v":0},{"$f":"T71","v":18},"S",3,{"$f":"Score!O19","v":23},{"$f":"LOOKUP(X8,Names!$A$2:$A$161,Names!$B$2:$B$161)","v":"مصطفى يوسف محمد"},136,{"$f":"Sheet1!$M$6","v":0},{"$f":"T72","v":17}]
{"$rows_left_out":101}
{"sheet":"R4","index":5,"n_rows":108,"n_cols":28,"rows_kept":108,"cut":false,"hidden":false,"merged":[[0,11,0,17],[0,24,2,26],[2,11,2,17],[3,3,3,5],[3,10,3,12],[3,17,3,19],[3,24,3,26],[34,3,34,5],[34,10,34,12],[34,17,34,19],[34,24,34,26],[9,3,9,5],[9,10,9,12],[9,17,9,19],[9,24,9,26],[15,3,15,5],[15,10,15,12],[15,17,15,19],[15,24,15,26],[21,3,21,5],[21,10,21,12],[21,17,21,19],[21,24,21,26],[27,3,27,5],[27,10,27,12],[27,17,27,19],[27,24,27,26],[66,3,66,5],[66,10,66,12],[66,17,66,19],[66,24,66,26],[52,3,52,5],[52,10,52,12],[52,17,52,19],[52,24,52,26],[65,10,65,19],[58,3,58,5],[58,10,58,12],[58,17,58,19],[58,24,58,26],[40,3,40,5],[40,10,40,12],[40,17,40,19],[40,24,40,26],[46,3,46,5],[46,10,46,12],[46,17,46,19],[46,24,46,26]]}
[null,null,null,null,null,null,null,null,null,null,"التوقيت :","Round ( 4 )",null,null,null,null,null,null,null,null,null,null,null,null,{"$f":"Score!T1","v":"بطولة الجمهورية الثانية\nللفردي المفتوح"}]
[]
[null,null,null,null,null,null,null,null,null,null,"5.00 PM","Tab."]
[null,null,null,1,null,null,null,null,null,null,2,null,null,null,null,null,null,3,null,null,null,null,null,null,4]
[null,null,null,"Names","Sc.","Tab",null,null,null,null,"Names","Sc.","Tab",null,null,null,null,"Names","Sc.","Tab",null,null,null,null,"Names","Sc.","Tab"]
["N",1,{"$f":"Score!O5","v":1},{"$f":"LOOKUP(C6,Names!$A$2:$A$161,Names!$B$2:$B$161)","v":"راجي صبحي  "},89,{"$f":"Sheet1!$M$4","v":0},{"$f":"F69","v":21},"N",1,{"$f":"Score!U9","v":74},{"$f":"LOOKUP(J6,Names!$A$2:$A$161,Names!$B$2:$B$161)","v":"فريدة شكري"},85,{"$f":"Sheet1!$M$4","v":0},{"$f":"F70","v":19},"N",1,{"$f":"Score!U13","v":67},{"$f":"LOOKUP(Q6,Names!$A$2:$A$161,Names!$B$2:$B$161)","v":"محمد محمود فضل "},119,{"$f":"Sheet1!$M$4","v":0},{"$f":"F71","v":18},"N",1,{"$f":"Score!U17","v":60},{"$f":"LOOKUP(X6,Names!$A$2:$A$161,Names!$B$2:$B$161)","v":"عصام الدين حامد منصور "},90,{"$f":"Sheet1!$M$4","v":0},{"$f":"F72","v":17}]
["W",2,{"$f":"Score!U6","v":70},{"$f":"LOOKUP(C7,Names!$A$2:$A$161,Names!$B$2:$B$161)","v":"أحمد صلاح الدين دياب "},67,{"$f":"Sheet1!$M$5","v":0},{"$f":"M69","v":21},"W",2,{"$f":"Score!U10","v":63},{"$f":"LOOKUP(J7,Names!$A$2:$A$161,Names!$B$2:$B$161)","v":"محمد أحمد محمد عبد الله "},149,{"$f":"Sheet1!$M$5","v":0},{"$f":"M70","v":19},"W",2,{"$f":"Score!U14","v":56},{"$f":"LOOKUP(Q7,Names!$A$2:$A$161,Names!$B$2:$B$161)","v":"جاسر محمد"},120,{"$f":"Sheet1!$M$5","v":0},{"$f":"M71","v":18},"W",2,{"$f":"Score!U18","v":13},{"$f":"LOOKUP(X7,Names!$A$2:$A$161,Names!$B$2:$B$161)","v":"أحمد جميل السيد "},120,{"$f":"Sheet1!$M$5","v":0},{"$f":"M72","v":17}]
["S",3,{"$f":"Score!U7","v":59},{"$f":"LOOKUP(C8,Names!$A$2:$A$161,Names!$B$2:$B$161)","v":"هشام أبوغربية "},163,{"$f":"Sheet1!$M$6","v":0},{"$f":"T69","v":21},"S",3,{"$f":"Score!U11","v":52},{"$f":"LOOKUP(J8,Names!$A$2:$A$161,Names!$B$2:$B$161)","v":"يامن محمد حسن  "},17,{"$f":"Sheet1!$M$6","v":0},{"$f":"T70","v":19},"S",3,{"$f":"Score!U15","v":9},{"$f":"LOOKUP(Q8,Names!$A$2:$A$161,Names!$B$2:$B$161)","v":"رأفت الصياد"},184,{"$f":"Sheet1!$M$6","v":0},{"$f":"T71","v":18},"S",3,{"$f":"Score!U19","v":2},{"$f":"LOOKUP(X8,Names!$A$2:$A$161,Names!$B$2:$B$161)","v":"شريف أحمد محمد حمروش"},61,{"$f":"Sheet1!$M$6","v":0},{"$f":"T72","v":17}]
{"$rows_left_out":101}
{"sheet":"Sheet1","index":6,"n_rows":82,"n_cols":15,"rows_kept":82,"cut":false,"hidden":false,"merged":[[74,0,77,0],[78,0,81,0],[50,0,53,0],[54,0,57,0],[58,0,61,0],[62,0,65,0],[66,0,69,0],[70,0,73,0],[46,0,49,0],[2,0,5,0],[6,0,9,0],[10,0,13,0],[14,0,17,0],[18,0,21,0],[22,0,25,0],[26,0,29,0],[30,0,33,0],[34,0,37,0],[38,0,41,0],[42,0,45,0]]}
[]
[]
[1,81,1,null,1,{"$f":"LOOKUP(E3,$C$3:$C$82,$B$3:$B$82)","v":81},null,1,1,null,null,{"$f":"$M$3+1","v":21},20,"عدد الطاولات"]
[null,82,2,null,38,{"$f":"LOOKUP(E4,$C$3:$C$82,$B$3:$B$82)","v":118},null,2,2,null,null,{"$f":"L3-2","v":19},null,0.25,"الأول"]
[null,83,3,null,27,107,null,3,3,null,null,{"$f":"L4-1","v":18},null,0.15,"الثاني"]
[null,84,4,null,16,96,null,4,4,null,null,17,null,0.1,"الثالث"]
[2,85,5,null,5,85,null,5,5,null,null,16,null,0,"الرابع"]
[null,86,6,null,42,122,null,6,6,null,null,15]
{"$rows_left_out":75}
{"sheet":"MP_PP","index":7,"n_rows":162,"n_cols":6,"rows_kept":162,"cut":false,"hidden":false,"merged":[[0,0,1,0],[0,1,1,1],[0,2,1,2],[0,3,1,3]]}
["P. No.","Names","رقم العضوية","R."]
[]
[65,{"$f":"LOOKUP(A3,Names!$A$2:$A$161,Names!$B$2:$B$161)","v":"أحمد طارق   "},{"$f":"LOOKUP(A3,Names!$A$2:$A$161,Names!$C$2:$C$161)","v":346},{"$f":"Score!AT5","v":1},1000,7]
[95,{"$f":"LOOKUP(A4,Names!$A$2:$A$161,Names!$B$2:$B$161)","v":0},{"$f":"LOOKUP(A4,Names!$A$2:$A$161,Names!$C$2:$C$161)","v":0},{"$f":"Score!AT6","v":2},800,5]
[12,{"$f":"LOOKUP(A5,Names!$A$2:$A$161,Names!$B$2:$B$161)","v":"أمير كمال جميل"},{"$f":"LOOKUP(A5,Names!$A$2:$A$161,Names!$C$2:$C$161)","v":2001},{"$f":"Score!AT7","v":3},700,3]
[27,{"$f":"LOOKUP(A6,Names!$A$2:$A$161,Names!$B$2:$B$161)","v":"سمير الحوفي"},{"$f":"LOOKUP(A6,Names!$A$2:$A$161,Names!$C$2:$C$161)","v":2007},{"$f":"Score!AT8","v":4},500,2]
[30,{"$f":"LOOKUP(A7,Names!$A$2:$A$161,Names!$B$2:$B$161)","v":"شريف جلال سماحة "},{"$f":"LOOKUP(A7,Names!$A$2:$A$161,Names!$C$2:$C$161)","v":718},{"$f":"Score!AT9","v":5},476.85185185185185,1]
[90,{"$f":"LOOKUP(A8,Names!$A$2:$A$161,Names!$B$2:$B$161)","v":0},{"$f":"LOOKUP(A8,Names!$A$2:$A$161,Names!$C$2:$C$161)","v":0},{"$f":"Score!AT10","v":6},472.22222222222223]
{"$rows_left_out":154}